Opened 12 years ago

Closed 12 years ago

#1310 closed defect (invalid)

Error compiling rev 3993

Reported by: tanica76 Owned by:
Priority: blocker Component: ! Please select...
Severity: Please fill in Keywords:
Cc: Sensitive: no

Description

Revision

3993

Issue Description

Error in rc6.h and rc6.c

When the issue occurs

Bulding make

How the issue is reproducable

executing make command

[ 91%] Building C object cscrypt/CMakeFiles/cscrypt.dir/bn_shift.o
[ 92%] Building C object cscrypt/CMakeFiles/cscrypt.dir/rc6.o
In file included from /home/davide/OScamdevel/oscam-build/cscrypt/rc6.c:20:
/home/ubuntu/OScamdevel/oscam-build/cscrypt/rc6.h:38: error: parse error before ';' token
/home/ubuntu/OScamdevel/oscam-build/cscrypt/rc6.c:197:3: no newline at end of file
make[2]: *** [cscrypt/CMakeFiles/cscrypt.dir/rc6.o] Error 1
make[1]: *** [cscrypt/CMakeFiles/cscrypt.dir/all] Error 2
make: *** [all] Error 2

Change History (1)

comment:1 by Deas, 12 years ago

Resolution: invalid
Status: newclosed

i don´t know how often we must say this - don´t open tickets very short after a commit for "trivial" problems on a TRUNK WHICH IS UNDER DEVELOPMENT!!!!!

not each rev of trunk must be able to build. please accept this and use streamboard forum to post these problems.

Note: See TracTickets for help on using tickets.