Opened 12 years ago

Closed 12 years ago

#1380 closed defect (fixed)

4165 doesn't compile

Reported by: boubaris Owned by:
Priority: blocker Component: ! Please select...
Severity: high Keywords:
Cc: Sensitive: no




Issue Description

cannor compile 4165

When the issue occurs

<Please fill in>

How the issue is reproducable

<Please fill in>

<Don't forget to ATTACH (not post here) a log file of oscam in debug mode (start oscam with -d255)!>

/root/OSCAM/oscam-svn/oscam.c: In function ‘main’:
/root/OSCAM/oscam-svn/oscam.c:3148: error: ‘cs_restart_mode’ undeclared (first use in this function)
/root/OSCAM/oscam-svn/oscam.c:3148: error: (Each undeclared identifier is reported only once
/root/OSCAM/oscam-svn/oscam.c:3148: error: for each function it appears in.)
make[2]: * [CMakeFiles/oscam.dir/oscam.o] Error 1
* [CMakeFiles/oscam.dir/all] Error 2

Change History (1)

comment:1 by boubaris, 12 years ago

Resolution: fixed
Status: newclosed


Note: See TracTickets for help on using tickets.