Opened 12 years ago

Closed 12 years ago

#336 closed defect (fixed)

svn1176 - Compiling fails

Reported by: wiwe Owned by:
Priority: major Component:
Severity: medium Keywords: csctapi, apdu
Cc: Sensitive: no

Description

[ 48%] Building C object csctapi/CMakeFiles/csctapi.dir/apdu.o
/home/Willy/monitor-improvement/csctapi/apdu.c: In function `APDU_Cmd_Case':
/home/Willy/monitor-improvement/csctapi/apdu.c:81: error: `ushort' undeclared (f
irst use in this function)
/home/Willy/monitor-improvement/csctapi/apdu.c:81: error: (Each undeclared ident
ifier is reported only once
/home/Willy/monitor-improvement/csctapi/apdu.c:81: error: for each function it a
ppears in.)
/home/Willy/monitor-improvement/csctapi/apdu.c:81: error: parse error before "B2
B3"
/home/Willy/monitor-improvement/csctapi/apdu.c:82: error: `ulong' undeclared (fi
rst use in this function)
/home/Willy/monitor-improvement/csctapi/apdu.c:86: error: `L' undeclared (first
use in this function)
/home/Willy/monitor-improvement/csctapi/apdu.c:98: error: parse error before "B1
"
/home/Willy/monitor-improvement/csctapi/apdu.c:102: error: parse error before "B
1"
/home/Willy/monitor-improvement/csctapi/apdu.c:107: error: `B2B3' undeclared (fi
rst use in this function)
/home/Willy/monitor-improvement/csctapi/apdu.c:109: error: parse error before "B
2B3"
/home/Willy/monitor-improvement/csctapi/apdu.c:113: error: parse error before "B
2B3"
make[2]: * [csctapi/CMakeFiles/csctapi.dir/apdu.o] Error 1
make[1]:
* [csctapi/CMakeFiles/csctapi.dir/all] Error 2
make: * [all] Error 2

Change History (1)

comment:1 by wiwe, 12 years ago

Resolution: fixed
Status: newclosed

see tickett 337

Note: See TracTickets for help on using tickets.