Opened 11 years ago

Closed 11 years ago

#365 closed defect (invalid)

Unable to compile mipsel uclibc 0.9.28

Reported by: FunMan Owned by:
Priority: major Component:
Severity: high Keywords:
Cc: Sensitive: no

Description

I'm unable to compile latest revision for mipsel uclibc 0.9.28 (dd-wrt). The last compiling revision is 1219

oscam-svn
[  1%] Building C object CMakeFiles/csmodules.dir/module-dvbapi.o
[  3%] Building C object CMakeFiles/csmodules.dir/module-serial.o
[  4%] Building C object CMakeFiles/csmodules.dir/module-camd35.o
[  6%] Building C object CMakeFiles/csmodules.dir/module-newcamd.o
[  8%] Building C object CMakeFiles/csmodules.dir/module-camd33.o
[  9%] Building C object CMakeFiles/csmodules.dir/module-monitor.o
[ 11%] Building C object CMakeFiles/csmodules.dir/module-radegast.o
[ 13%] Building C object CMakeFiles/csmodules.dir/module-cccam.o
Linking C static library libcsmodules.a
[ 13%] Built target csmodules
[ 13%] Built target svnversion-log
[ 14%] Building C object CMakeFiles/csoscam.dir/oscam-reader.o
/home/daniele/development/oscam/oscam-svn/oscam-reader.c: In function 'cs_ri_brk':
/home/daniele/development/oscam/oscam-svn/oscam-reader.c:10: warning: unused parameter 'flag'
[ 16%] Building C object CMakeFiles/csoscam.dir/oscam-simples.o
/home/daniele/development/oscam/oscam-svn/oscam-simples.c: In function 'cs_ftime':
/home/daniele/development/oscam/oscam-svn/oscam-simples.c:307: warning: implicit declaration of function 'gettimeofday'
[ 18%] Building C object CMakeFiles/csoscam.dir/oscam-nano.o
[ 19%] Building C object CMakeFiles/csoscam.dir/oscam-chk.o
[ 21%] Building C object CMakeFiles/csoscam.dir/oscam-ac.o
[ 22%] Building C object CMakeFiles/csoscam.dir/oscam-log.o
[ 24%] Building C object CMakeFiles/csoscam.dir/oscam-config.o
Linking C static library libcsoscam.a
[ 24%] Built target csoscam
[ 26%] Building C object CMakeFiles/csreaders.dir/reader-irdeto.o
[ 27%] Building C object CMakeFiles/csreaders.dir/reader-videoguard2.o
[ 29%] Building C object CMakeFiles/csreaders.dir/reader-pcsc.o
[ 31%] Building C object CMakeFiles/csreaders.dir/reader-conax.o
[ 32%] Building C object CMakeFiles/csreaders.dir/reader-common.o
[ 34%] Building C object CMakeFiles/csreaders.dir/reader-seca.o
[ 36%] Building C object CMakeFiles/csreaders.dir/reader-nagra.o
[ 37%] Building C object CMakeFiles/csreaders.dir/reader-dre.o
[ 39%] Building C object CMakeFiles/csreaders.dir/reader-cryptoworks.o
[ 40%] Building C object CMakeFiles/csreaders.dir/reader-viaccess.o
Linking C static library libcsreaders.a
[ 40%] Built target csreaders
[ 40%] Built target svnversion
[ 42%] Building C object csctapi/CMakeFiles/csctapi.dir/ct_slot.o
[ 44%] Building C object csctapi/CMakeFiles/csctapi.dir/io_serial.o
[ 45%] Building C object csctapi/CMakeFiles/csctapi.dir/apdu.o
[ 47%] Building C object csctapi/CMakeFiles/csctapi.dir/protocol_t1.o
[ 49%] Building C object csctapi/CMakeFiles/csctapi.dir/icc_async.o
/home/daniele/development/oscam/oscam-svn/csctapi/icc_async.c: In function 'ICC_Async_GetStatus':
/home/daniele/development/oscam/oscam-svn/csctapi/icc_async.c:150: error: 'gpio_detect' undeclared (first use in this function)
/home/daniele/development/oscam/oscam-svn/csctapi/icc_async.c:150: error: (Each undeclared identifier is reported only once
/home/daniele/development/oscam/oscam-svn/csctapi/icc_async.c:150: error: for each function it appears in.)
make[2]: *** [csctapi/CMakeFiles/csctapi.dir/icc_async.o] Error 1
make[1]: *** [csctapi/CMakeFiles/csctapi.dir/all] Error 2
make: *** [all] Error 2

Change History (1)

comment:1 by Eneen, 11 years ago

Resolution: invalid
Status: newclosed

Lastest svn should compile fine.

Note: See TracTickets for help on using tickets.