Opened 11 years ago

Closed 11 years ago

#377 closed defect (fixed)

Error building # 1324 (mipsel - ppc)

Reported by: Spaeleus Owned by:
Priority: major Component:
Severity: medium Keywords:
Cc: Sensitive: no

Description

Build hangs wit this error:

Linking C static library libcscrypt.a
[ 73%] Built target cscrypt
Scanning dependencies of target csctapi
[ 75%] Building C object csctapi/CMakeFiles/csctapi.dir/ctapi.o
[ 76%] Building C object csctapi/CMakeFiles/csctapi.dir/t1_block.o
[ 78%] Building C object csctapi/CMakeFiles/csctapi.dir/icc_async.o
In file included from /home/dario/tuxbox/oscam-svn/csctapi/icc_async.c:31:
/home/dario/tuxbox/oscam-svn/csctapi/ifd.h:7:25: error: ifd_phoenix.h: No such file or directory
make[2]: *** [csctapi/CMakeFiles/csctapi.dir/icc_async.o] Errore 1
make[1]: *** [csctapi/CMakeFiles/csctapi.dir/all] Errore 2
make: *** [all] Errore 2

Change History (1)

comment:1 by landlord, 11 years ago

Resolution: fixed
Status: newclosed

"Fixed" with 1325.

Note: See TracTickets for help on using tickets.