Opened 6 years ago

Closed 6 years ago

#4019 closed enhancement (invalid)

Fehler nach OS Update

Reported by: Sven B. Owned by:
Priority: critical Component: Webinterface
Severity: medium Keywords:
Cc: Sensitive: no

Description

Hallo,

bekomme nach OS update diese meldung:

/var/emu/oscam/trunk/webif/pages.c:3:0: error: unterminated #ifdef
make[2]: * [CMakeFiles/csmodules.dir/webif/pages.o] Fehler 1
make[1]:
* [CMakeFiles/csmodules.dir/all] Fehler 2
make: * [all] Fehler 2
cp: Aufruf von stat für âoscamâ nicht möglich: Datei oder Verzeichnis nicht gefunden.

Kann mir bitte jemand sagen wie das behoben werden kann?
Danke im voraus.

Change History (2)

in reply to:  description comment:1 by Sven B., 6 years ago

Replying to Guru39:

Hallo,

bekomme nach OS update diese meldung:

/var/emu/oscam/trunk/webif/pages.c:3:0: error: unterminated #ifdef
make[2]: * [CMakeFiles/csmodules.dir/webif/pages.o] Fehler 1
make[1]:
* [CMakeFiles/csmodules.dir/all] Fehler 2
make: * [all] Fehler 2
cp: Aufruf von stat für âoscamâ nicht möglich: Datei oder Verzeichnis nicht gefunden.

Kann mir bitte jemand sagen wie das behoben werden kann?
Danke im voraus.

hello,
get after OS update this message:
/var/emu/oscam/trunk/webif/pages.c:3:0: error: unterminated #ifdef
make [2]: * [CMakeFiles / csmodules.dir / webif / pages.o] Error 1
make [1]: * [CMakeFiles / csmodules.dir / all] Error 2
make: * [all] Error 2
cp: call stat for âoscamâ not possible: File or directory not found.

Can someone please tell me how this can be fixed?
Thanks in advance.

comment:2 by Hunchback, 6 years ago

Resolution: invalid
Status: newclosed

Buddy, das hier ist kein Forum sondern ein Bugtracker.

And the lanuage of this Bugtracker is English. Please look for help in the Forum!

Greetz

Note: See TracTickets for help on using tickets.