Opened 13 years ago

Closed 13 years ago

#451 closed defect (fixed)

error building #1867

Reported by: Spaeleus Owned by:
Priority: major Component:
Severity: high Keywords:
Cc: Sensitive: no


Build #1867 hangs (mipsel-ppc.linux-pc) with this error:

[ 96%] Built target svnversion
Scanning dependencies of target oscam
[ 98%] Building C object CMakeFiles/oscam.dir/oscam.o
Linking C executable oscam
libcsoscam.a(oscam-http.o): In function `send_oscam_services':
oscam-http.c:(.text+0x2185): undefined reference to `monitor_get_srvname'
libcsoscam.a(oscam-http.o): In function `send_oscam_user_config':
oscam-http.c:(.text+0x3ef6): undefined reference to `monitor_get_srvname'
collect2: ld returned 1 exit status
make[2]: *** [oscam] Errore 1
make[1]: *** [CMakeFiles/oscam.dir/all] Errore 2
make: *** [all] Errore 2

Change History (1)

comment:1 by alno, 13 years ago

Resolution: fixed
Status: newclosed

fixed in 1868 or monimp10

Note: See TracTickets for help on using tickets.