Opened 12 years ago

Closed 12 years ago

Last modified 12 years ago

#466 closed defect (fixed)

error building #1962 for pc-linux

Reported by: Spaeleus Owned by: merek
Priority: major Component:
Severity: medium Keywords:
Cc: Sensitive: no

Description

#1962 build for pc-linux fails with this error:

[ 91%] Building C object csctapi/CMakeFiles/csctapi.dir/ifd_phoenix.o
[ 92%] Building C object csctapi/CMakeFiles/csctapi.dir/ifd_sc8in1.o
cc1: warnings being treated as errors
/home/dario/tuxbox/SB-oscam-svn-trunk/csctapi/ifd_sc8in1.c: In function ‘sc8in1_command’:
/home/dario/tuxbox/SB-oscam-svn-trunk/csctapi/ifd_sc8in1.c:59: error: ignoring return value of ‘write’, declared with attribute warn_unused_result
make[2]: *** [csctapi/CMakeFiles/csctapi.dir/ifd_sc8in1.o] Errore 1
make[1]: *** [csctapi/CMakeFiles/csctapi.dir/all] Errore 2
make: *** [all] Errore 2

Thx!

Change History (3)

comment:1 by merek, 12 years ago

Owner: set to merek
Status: newassigned

comment:2 by merek, 12 years ago

Resolution: fixed
Status: assignedclosed

solved in r1963

comment:3 by Spaeleus, 12 years ago

Thx!

Note: See TracTickets for help on using tickets.