Opened 2 years ago

Closed 2 years ago

#4714 closed defect (fixed)

Build-Error while building without WebIf and LCDSUPPORT

Reported by: the.sniffer Owned by:
Priority: blocker Component: General
Severity: high Keywords: Building
Cc: Sensitive: yes

Description

Revision 11491 and later

When the issue occurs

While building OSCam

How the issue is reproducable

While building OSCam

+-------------------------------------------------------------------------------
| OSCam ver: 1.20_svn rev: 11493 target: x86_64-linux-gnu-ssl-libusb-pcsc
| Tools:
| CROSS =
| CC = gcc
| Settings:
| CONF_DIR = /usr/local/etc
| CC_OPTS = -Os -ggdb -pipe -ffunction-sections -fdata-sections
| CC_WARN = -w
| CFLAGS = -DWITH_SSL=1 -DWITH_LIBCRYPTO=1 -DWITH_LIBUSB=1 -DWITH_PCSC=1 -I/usr/include/PCSC -I/usr/include/../local/include/PCSC
| LDFLAGS = -Wl,--gc-sections -DWITH_SSL=1 -DWITH_LIBCRYPTO=1 -DWITH_LIBUSB=1 -DWITH_PCSC=1 -I/usr/include/PCSC -I/usr/include/../local/include/PCSC -lz -Wl,-rpath,/usr/lib
| LIBS = -lssl -lcrypto -lusb-1.0 -lrt -lpcsclite -lm -lpthread -ldl -lrt
| UseFlags = USE_SSL=1 USE_LIBCRYPTO=1 USE_LIBUSB=1 USE_PCSC=1
| Config:
| Addons : TOUCH WITH_SSL HAVE_DVBAPI WITH_NEUTRINO READ_SDT_CHARSETS IRDETO_GUESSING CS_ANTICASC WITH_DEBUG MODULE_MONITOR WITH_LB CS_CACHEEX CW_CYCLE_CHECK LEDSUPPORT CLOCKFIX IPV6SUPPORT
| Protocols: CAMD33 CAMD35 CAMD35_TCP NEWCAMD CCCAM CCCSHARE GBOX RADEGAST SCAM SERIAL CONSTCW PANDORA GHTTP
| Readers : NAGRA NAGRA_MERLIN IRDETO CONAX CRYPTOWORKS SECA VIACCESS VIDEOGUARD DRE TONGFANG BULCRYPT GRIFFIN DGCRYPT
| CardRdrs : PHOENIX INTERNAL SC8IN1 MP35 SMARGO DB2COM STAPI STAPI5 STINGER DRECAS SMART PCSC
| Compiler : gcc (Ubuntu 7.3.0-27ubuntu1~18.04) 7.3.0
| Config : build/x86_64-linux-gnu-ssl-libusb-pcsc/config.mak
| Binary : ../archiv/oscam-svn11493-Linux-x86_64-ssl-libusb-pcsc
+-------------------------------------------------------------------------------
.
.
.
CC oscam-emm.c
oscam-emm.c: In function ‘do_emm’:
oscam-emm.c:503:14: error: ‘struct s_reader’ has no member named ‘emmblocked’; did you mean ‘block3’?

aureader->emmblocked[ep->type]++;

~
block3

oscam-emm.c:504:14: error: ‘struct s_reader’ has no member named ‘webif_emmblocked’; did you mean ‘webif_ecmsok’?

aureader->webif_emmblocked[ep->type]++;

~
webif_ecmsok

oscam-emm.c:505:27: error: ‘struct s_reader’ has no member named ‘emmblocked’; did you mean ‘block3’?

is_blocked = aureader->emmblocked[ep->type];

~
block3

Makefile:421: recipe for target 'build/x86_64-linux-gnu-ssl-libusb-pcsc/oscam-emm.o' failed
make[1]: * [build/x86_64-linux-gnu-ssl-libusb-pcsc/oscam-emm.o] Error 1
make[1]:
* Auf noch nicht beendete Prozesse wird gewartet …
Makefile:373: recipe for target 'all' failed
make: * [all] Error 2

Change History (1)

comment:1 by the.sniffer, 2 years ago

Resolution: fixed
Status: newclosed

ok with revision 11494. THX Gorgone

Note: See TracTickets for help on using tickets.